Version Order Number
description: Indicates the order of a transcription within a version chain. The first transcription will always have the version number 0001 and the head transcription will always have the highest number within the series.
type: Property
domain: transcription
range: Literal